Reaction Details
TargetAdenosine receptor A3
LigandBDBM21220
Substrate/Competitorn/a
Meas. Tech.ChEMBL_2199478 (CHEMBL5111994)
IC50 0.933254±n/a nM
Citation Stampelou, MSuchankova, ATzortzini, EDhingra, LBarkan, KLougiakis, NMarakos, PPouli, NLadds, GKolocouris, A Dual A1/A3 Adenosine Receptor Antagonists: Binding Kinetics and Structure-Activity Relationship Studies Using Mutagenesis and Alchemical Binding Free Energy Calculations. J Med Chem65:13305-13327 (2022) 
 
Adenosine receptor A3
Name:Adenosine receptor A3
Type:G Protein-Coupled Receptor (GPCR)
Mol. Mass.:36197.32
Organism:Homo sapiens (Human)
Description:P0DMS8
Residue:318
BDBM21220
NameBDBM21220
Synonyms:(2S,3S,4R,5R)-5-(6-amino-9H-purin-9-yl)-N-ethyl-3,4-dihydroxyoxolane-2-carboxamide Adenosine, N6-Ethyl-carboxamido CHEMBL464859 NECA
TypeAntineoplastic Agent
Emp. Form.C12H16N6O4
Mol. Mass.308.2932
SMILESCCNC(=O)[C@H]1O[C@H]([C@H](O)[C@@H]1O)n1cnc2c(N)ncnc12