Reaction Details
TargetAdenosine receptor A3
LigandBDBM50591171
Substrate/Competitorn/a
Meas. Tech.ChEMBL_2199480 (CHEMBL5111996)
Kd 302±n/a nM
Citation Stampelou, MSuchankova, ATzortzini, EDhingra, LBarkan, KLougiakis, NMarakos, PPouli, NLadds, GKolocouris, A Dual A1/A3 Adenosine Receptor Antagonists: Binding Kinetics and Structure-Activity Relationship Studies Using Mutagenesis and Alchemical Binding Free Energy Calculations. J Med Chem65:13305-13327 (2022) 
 
Adenosine receptor A3
Name:Adenosine receptor A3
Type:G Protein-Coupled Receptor (GPCR)
Mol. Mass.:36197.32
Organism:Homo sapiens (Human)
Description:P0DMS8
Residue:318
BDBM50591171
NameBDBM50591171
Synonyms:CHEMBL5174600
TypeSmall organic molecule
Emp. Form.C20H24N6O
Mol. Mass.364.4442
SMILESCn1nc(NC(=O)Nc2ccccc2)c2ccnc(NC3CCCCC3)c12