Reaction Details
TargetAdenosine receptor A3
LigandBDBM50591163
Substrate/Competitorn/a
Meas. Tech.ChEMBL_2199491 (CHEMBL5112007)
Kd 74±n/a nM
Citation Stampelou, MSuchankova, ATzortzini, EDhingra, LBarkan, KLougiakis, NMarakos, PPouli, NLadds, GKolocouris, A Dual A1/A3 Adenosine Receptor Antagonists: Binding Kinetics and Structure-Activity Relationship Studies Using Mutagenesis and Alchemical Binding Free Energy Calculations. J Med Chem65:13305-13327 (2022) 
 
Adenosine receptor A3
Name:Adenosine receptor A3
Type:G Protein-Coupled Receptor (GPCR)
Mol. Mass.:36197.32
Organism:Homo sapiens (Human)
Description:P0DMS8
Residue:318
BDBM50591163
NameBDBM50591163
Synonyms:CHEMBL3929143
TypeSmall organic molecule
Emp. Form.C21H20N4O3
Mol. Mass.376.4085
SMILESCOc1cc(Nc2nccc3c(n[nH]c23)-c2ccccc2)cc(OC)c1OC