Reaction Details
TargetCarbonic anhydrase 4
LigandBDBM50164076
Substrate/Competitorn/a
Meas. Tech.ChEMBL_302185 (CHEMBL829425)
Ki 500000±n/a nM
Citation Innocenti, AAntel, JWurl, MVullo, DFirnges, MAScozzafava, ASupuran, CT Carbonic anhydrase inhibitors. Inhibition of isozymes I, II, IV, V and IX with complex fluorides, chlorides and cyanides. Bioorg Med Chem Lett15:1909-13 (2005) 
 
Carbonic anhydrase 4
Name:Carbonic anhydrase 4
Type:Enzyme
Mol. Mass.:35037.98
Organism:Homo sapiens (Human)
Description:P22748
Residue:312
BDBM50164076
NameBDBM50164076
Synonyms:CHEMBL180968 | [NbF7]2-
TypeSmall organic molecule
Emp. Form.F7Nb
Mol. Mass.225.8963
SMILESF[Nb--](F)(F)(F)(F)(F)F