Reaction Details
TargetCarbonic anhydrase 4
LigandBDBM50164078
Substrate/Competitorn/a
Meas. Tech.ChEMBL_302185 (CHEMBL829425)
Ki 340000±n/a nM
Citation Innocenti, AAntel, JWurl, MVullo, DFirnges, MAScozzafava, ASupuran, CT Carbonic anhydrase inhibitors. Inhibition of isozymes I, II, IV, V and IX with complex fluorides, chlorides and cyanides. Bioorg Med Chem Lett15:1909-13 (2005) 
 
Carbonic anhydrase 4
Name:Carbonic anhydrase 4
Type:Enzyme
Mol. Mass.:35037.98
Organism:Homo sapiens (Human)
Description:P22748
Residue:312
BDBM50164078
NameBDBM50164078
Synonyms:CHEMBL367362 hexafluoridoferrate(3-)hexafluoridoferrate(III) | hexafluoroferrate(3-)
TypeSmall organic molecule
Emp. Form.F6Fe
Mol. Mass.169.837
SMILESF[Fe-3](F)(F)(F)(F)F