Reaction Details
TargetCarbonic anhydrase 1
LigandBDBM50164086
Substrate/Competitorn/a
Meas. Tech.ChEMBL_302184 (CHEMBL829424)
Ki 7700±n/a nM
Citation Innocenti, AAntel, JWurl, MVullo, DFirnges, MAScozzafava, ASupuran, CT Carbonic anhydrase inhibitors. Inhibition of isozymes I, II, IV, V and IX with complex fluorides, chlorides and cyanides. Bioorg Med Chem Lett15:1909-13 (2005) 
 
Carbonic anhydrase 1
Name:Carbonic anhydrase 1
Type:Enzyme
Mol. Mass.:28873.37
Organism:Homo sapiens (Human)
Description:P00915
Residue:261
BDBM50164086
NameBDBM50164086
Synonyms:CHEMBL180870 | [Au(CN)2]-
TypeSmall organic molecule
Emp. Form.C2AuN2
Mol. Mass.249.0019
SMILESN#C[Au-]C#N