Reaction Details
TargetCarbonic anhydrase 2
LigandBDBM50164088
Substrate/Competitorn/a
Meas. Tech.ChEMBL_302182 (CHEMBL830215)
Ki 1220000±n/a nM
Citation Innocenti, AAntel, JWurl, MVullo, DFirnges, MAScozzafava, ASupuran, CT Carbonic anhydrase inhibitors. Inhibition of isozymes I, II, IV, V and IX with complex fluorides, chlorides and cyanides. Bioorg Med Chem Lett15:1909-13 (2005) 
 
Carbonic anhydrase 2
Name:Carbonic anhydrase 2
Type:Enzyme
Mol. Mass.:29250.71
Organism:Homo sapiens (Human)
Description:P00918
Residue:260
BDBM50164088
NameBDBM50164088
Synonyms:CHEMBL362447 | [Pd(CN)4]2-
TypeSmall organic molecule
Emp. Form.C4N4Pd
Mol. Mass.210.49
SMILESN#C[Pd--](C#N)(C#N)C#N