Reaction Details
TargetCarbonic anhydrase 2
LigandBDBM50164082
Substrate/Competitorn/a
Meas. Tech.ChEMBL_302182 (CHEMBL830215)
Ki 560000.0±n/a nM
Citation Innocenti, AAntel, JWurl, MVullo, DFirnges, MAScozzafava, ASupuran, CT Carbonic anhydrase inhibitors. Inhibition of isozymes I, II, IV, V and IX with complex fluorides, chlorides and cyanides. Bioorg Med Chem Lett15:1909-13 (2005) 
 
Carbonic anhydrase 2
Name:Carbonic anhydrase 2
Type:Enzyme
Mol. Mass.:29250.71
Organism:Homo sapiens (Human)
Description:P00918
Residue:260
BDBM50164082
NameBDBM50164082
Synonyms:CHEMBL181104 | [Cu(CN)2]-
TypeSmall organic molecule
Emp. Form.C2CuN2
Mol. Mass.115.581
SMILESN#C[Cu-]C#N