Reaction Details
TargetCarbonic anhydrase 4
LigandBDBM50164079
Substrate/Competitorn/a
Meas. Tech.ChEMBL_302185 (CHEMBL829425)
Ki 124000000±n/a nM
Citation Innocenti, AAntel, JWurl, MVullo, DFirnges, MAScozzafava, ASupuran, CT Carbonic anhydrase inhibitors. Inhibition of isozymes I, II, IV, V and IX with complex fluorides, chlorides and cyanides. Bioorg Med Chem Lett15:1909-13 (2005) 
 
Carbonic anhydrase 4
Name:Carbonic anhydrase 4
Type:Enzyme
Mol. Mass.:35037.98
Organism:Homo sapiens (Human)
Description:P22748
Residue:312
BDBM50164079
NameBDBM50164079
Synonyms:(OC-6-11)-hexafluoroaluminate(3-) CHEMBL181624 hexafluoridoaluminate(3-) | hexafluoroaluminate(3-)
TypeSmall organic molecule
Emp. Form.AlF6
Mol. Mass.140.9736035
SMILESF[Al-3](F)(F)(F)(F)F