Reaction Details
TargetCarbonic anhydrase 5A, mitochondrial
LigandBDBM50164077
Substrate/Competitorn/a
Meas. Tech.ChEMBL_302181 (CHEMBL830214)
Ki 10800000±n/a nM
Citation Innocenti, AAntel, JWurl, MVullo, DFirnges, MAScozzafava, ASupuran, CT Carbonic anhydrase inhibitors. Inhibition of isozymes I, II, IV, V and IX with complex fluorides, chlorides and cyanides. Bioorg Med Chem Lett15:1909-13 (2005) 
 
Carbonic anhydrase 5A, mitochondrial
Name:Carbonic anhydrase 5A, mitochondrial
Type:Enzyme
Mol. Mass.:34755.54
Organism:Homo sapiens (Human)
Description:Human (cloned) isozyme
Residue:305
BDBM50164077
NameBDBM50164077
Synonyms:CHEMBL181256 hexachloridoplatinate(2-)hexachloridoplatinate(IV) | hexachloroplatinate(2-)
TypeSmall organic molecule
Emp. Form.Cl6Pt
Mol. Mass.407.803
SMILESCl[Pt--](Cl)(Cl)(Cl)(Cl)Cl