Reaction Details
TargetCarbonic anhydrase 9
LigandBDBM36130
Substrate/Competitorn/a
Meas. Tech.ChEMBL_302183 (CHEMBL829423)
Ki 8100000±n/a nM
Citation Innocenti, AAntel, JWurl, MVullo, DFirnges, MAScozzafava, ASupuran, CT Carbonic anhydrase inhibitors. Inhibition of isozymes I, II, IV, V and IX with complex fluorides, chlorides and cyanides. Bioorg Med Chem Lett15:1909-13 (2005) 
 
Carbonic anhydrase 9
Name:Carbonic anhydrase 9
Type:Enzyme
Mol. Mass.:49669.03
Organism:Homo sapiens (Human)
Description:Catalytic domain of human cloned isozyme was used in the assay
Residue:459
BDBM36130
NameBDBM36130
Synonyms:CHEMBL181124 | sodium hexafluorophosphate
TypeGuest
Emp. Form.F6P
Mol. Mass.144.96473
SMILESF[P-](F)(F)(F)(F)F