Reaction Details
TargetCarbonic anhydrase 1
LigandBDBM50164081
Substrate/Competitorn/a
Meas. Tech.ChEMBL_302184 (CHEMBL829424)
Ki 370000±n/a nM
Citation Innocenti, AAntel, JWurl, MVullo, DFirnges, MAScozzafava, ASupuran, CT Carbonic anhydrase inhibitors. Inhibition of isozymes I, II, IV, V and IX with complex fluorides, chlorides and cyanides. Bioorg Med Chem Lett15:1909-13 (2005) 
 
Carbonic anhydrase 1
Name:Carbonic anhydrase 1
Type:Enzyme
Mol. Mass.:28873.37
Organism:Homo sapiens (Human)
Description:P00915
Residue:261
BDBM50164081
NameBDBM50164081
Synonyms:CHEMBL366920 tetrachloridoplatinate(2-)tetrachloridoplatinate(II) | tetrachloroplatinate(2-)
TypeSmall organic molecule
Emp. Form.Cl4Pt
Mol. Mass.336.897
SMILESCl[Pt--](Cl)(Cl)Cl