Reaction Details
TargetWee1-like protein kinase
LigandBDBM50164141
Substrate/Competitorn/a
Meas. Tech.ChEMBL_304894 (CHEMBL829373)
IC50 1000±n/a nM
Citation Palmer, BDSmaill, JBRewcastle, GWDobrusin, EMKraker, AMoore, CWSteinkampf, RWDenny, WA Structure-activity relationships for 2-anilino-6-phenylpyrido[2,3-d]pyrimidin-7(8H)-ones as inhibitors of the cellular checkpoint kinase Wee1. Bioorg Med Chem Lett15:1931-5 (2005) 
 
Wee1-like protein kinase
Name:Wee1-like protein kinase
Type:PROTEIN
Mol. Mass.:71599.12
Organism:Homo sapiens (Human)
Description:ChEMBL_1445054
Residue:646
BDBM50164141
NameBDBM50164141
Synonyms:6-(3,5-Dihydroxy-2,6-dimethyl-phenyl)-8-methyl-2-phenylamino-8H-pyrido[2,3-d]pyrimidin-7-one | CHEMBL178439
TypeSmall organic molecule
Emp. Form.C22H20N4O3
Mol. Mass.388.4192
SMILESCc1c(O)cc(O)c(C)c1-c1cc2cnc(Nc3ccccc3)nc2n(C)c1=O