Reaction Details
TargetWee1-like protein kinase
LigandBDBM50164152
Substrate/Competitorn/a
Meas. Tech.ChEMBL_304894 (CHEMBL829373)
IC50 1200±n/a nM
Citation Palmer, BDSmaill, JBRewcastle, GWDobrusin, EMKraker, AMoore, CWSteinkampf, RWDenny, WA Structure-activity relationships for 2-anilino-6-phenylpyrido[2,3-d]pyrimidin-7(8H)-ones as inhibitors of the cellular checkpoint kinase Wee1. Bioorg Med Chem Lett15:1931-5 (2005) 
 
Wee1-like protein kinase
Name:Wee1-like protein kinase
Type:PROTEIN
Mol. Mass.:71599.12
Organism:Homo sapiens (Human)
Description:ChEMBL_1445054
Residue:646
BDBM50164152
NameBDBM50164152
Synonyms:6-(2,6-Dimethyl-phenyl)-5,8-dimethyl-2-phenylamino-8H-pyrido[2,3-d]pyrimidin-7-one | CHEMBL180794
TypeSmall organic molecule
Emp. Form.C23H22N4O
Mol. Mass.370.447
SMILESCc1cccc(C)c1-c1c(C)c2cnc(Nc3ccccc3)nc2n(C)c1=O