Reaction Details
TargetWee1-like protein kinase
LigandBDBM50164155
Substrate/Competitorn/a
Meas. Tech.ChEMBL_304894 (CHEMBL829373)
IC50 3400±n/a nM
Citation Palmer, BDSmaill, JBRewcastle, GWDobrusin, EMKraker, AMoore, CWSteinkampf, RWDenny, WA Structure-activity relationships for 2-anilino-6-phenylpyrido[2,3-d]pyrimidin-7(8H)-ones as inhibitors of the cellular checkpoint kinase Wee1. Bioorg Med Chem Lett15:1931-5 (2005) 
 
Wee1-like protein kinase
Name:Wee1-like protein kinase
Type:PROTEIN
Mol. Mass.:71599.12
Organism:Homo sapiens (Human)
Description:ChEMBL_1445054
Residue:646
BDBM50164155
NameBDBM50164155
Synonyms:6-(2-Chloro-6-methoxy-phenyl)-8-methyl-2-phenylamino-8H-pyrido[2,3-d]pyrimidin-7-one | CHEMBL181282
TypeSmall organic molecule
Emp. Form.C21H17ClN4O2
Mol. Mass.392.838
SMILESCOc1cccc(Cl)c1-c1cc2cnc(Nc3ccccc3)nc2n(C)c1=O