Reaction Details
TargetWee1-like protein kinase
LigandBDBM50164161
Substrate/Competitorn/a
Meas. Tech.ChEMBL_304894 (CHEMBL829373)
IC50 410±n/a nM
Citation Palmer, BDSmaill, JBRewcastle, GWDobrusin, EMKraker, AMoore, CWSteinkampf, RWDenny, WA Structure-activity relationships for 2-anilino-6-phenylpyrido[2,3-d]pyrimidin-7(8H)-ones as inhibitors of the cellular checkpoint kinase Wee1. Bioorg Med Chem Lett15:1931-5 (2005) 
 
Wee1-like protein kinase
Name:Wee1-like protein kinase
Type:PROTEIN
Mol. Mass.:71599.12
Organism:Homo sapiens (Human)
Description:ChEMBL_1445054
Residue:646
BDBM50164161
NameBDBM50164161
Synonyms:6-(2,6-Dibromo-phenyl)-8-methyl-2-phenylamino-8H-pyrido[2,3-d]pyrimidin-7-one | CHEMBL362402
TypeSmall organic molecule
Emp. Form.C20H14Br2N4O
Mol. Mass.486.159
SMILESCn1c2nc(Nc3ccccc3)ncc2cc(-c2c(Br)cccc2Br)c1=O