Reaction Details
TargetProthrombin
LigandBDBM50164258
Substrate/Competitorn/a
Meas. Tech.ChEMBL_302313 (CHEMBL828902)
Ki 3.3±n/a nM
Citation Stauffer, KJWilliams, PDSelnick, HGNantermet, PGNewton, CLHomnick, CFZrada, MMLewis, SDLucas, BJKrueger, JAPietrak, BLLyle, EASingh, RMiller-Stein, CWhite, RBWong, BWallace, AASitko, GRCook, JJHolahan, MAStranieri-Michener, MLeonard, YMLynch, JJMcMasters, DRYan, Y 9-hydroxyazafluorenes and their use in thrombin inhibitors. J Med Chem48:2282-93 (2005) 
 
Prothrombin
Name:Prothrombin
Type:Protein
Mol. Mass.:70029.57
Organism:Homo sapiens (Human)
Description:P00734
Residue:622
BDBM50164258
NameBDBM50164258
Synonyms:(S)-1-(5-Hydroxy-1-oxy-5H-indeno[1,2-b]pyridine-5-carbonyl)-pyrrolidine-2-carboxylic acid 2-aminomethyl-5-chloro-benzylamide | CHEMBL190491
TypeSmall organic molecule
Emp. Form.C26H25ClN4O4
Mol. Mass.492.954
SMILESNCc1ccc(Cl)cc1CNC(=O)[C@@H]1CCCN1C(=O)C1(O)c2ccccc2-c2c1ccc[n+]2[O-]