Reaction Details
TargetProthrombin
LigandBDBM50164262
Substrate/Competitorn/a
Meas. Tech.ChEMBL_302313 (CHEMBL828902)
Ki 37.0±n/a nM
Citation Stauffer, KJWilliams, PDSelnick, HGNantermet, PGNewton, CLHomnick, CFZrada, MMLewis, SDLucas, BJKrueger, JAPietrak, BLLyle, EASingh, RMiller-Stein, CWhite, RBWong, BWallace, AASitko, GRCook, JJHolahan, MAStranieri-Michener, MLeonard, YMLynch, JJMcMasters, DRYan, Y 9-hydroxyazafluorenes and their use in thrombin inhibitors. J Med Chem48:2282-93 (2005) 
 
Prothrombin
Name:Prothrombin
Type:Protein
Mol. Mass.:70029.57
Organism:Homo sapiens (Human)
Description:P00734
Residue:622
BDBM50164262
NameBDBM50164262
Synonyms:(S)-1-(9-Hydroxy-2-oxy-9H-indeno[2,1-c]pyridine-9-carbonyl)-pyrrolidine-2-carboxylic acid 2-aminomethyl-5-chloro-benzylamide | CHEMBL426806
TypeSmall organic molecule
Emp. Form.C26H25ClN4O4
Mol. Mass.492.954
SMILESNCc1ccc(Cl)cc1CNC(=O)[C@@H]1CCCN1C(=O)C1(O)c2ccccc2-c2cc[n+]([O-])cc12