Reaction Details
TargetProthrombin
LigandBDBM50164268
Substrate/Competitorn/a
Meas. Tech.ChEMBL_302313 (CHEMBL828902)
Ki 1.5±n/a nM
Citation Stauffer, KJWilliams, PDSelnick, HGNantermet, PGNewton, CLHomnick, CFZrada, MMLewis, SDLucas, BJKrueger, JAPietrak, BLLyle, EASingh, RMiller-Stein, CWhite, RBWong, BWallace, AASitko, GRCook, JJHolahan, MAStranieri-Michener, MLeonard, YMLynch, JJMcMasters, DRYan, Y 9-hydroxyazafluorenes and their use in thrombin inhibitors. J Med Chem48:2282-93 (2005) 
 
Prothrombin
Name:Prothrombin
Type:Protein
Mol. Mass.:70029.57
Organism:Homo sapiens (Human)
Description:P00734
Residue:622
BDBM50164268
NameBDBM50164268
Synonyms:(S)-1-(9-Hydroxy-9H-fluorene-9-carbonyl)-pyrrolidine-2-carboxylic acid (4-amino-cyclohexylmethyl)-amide | CHEMBL364255
TypeSmall organic molecule
Emp. Form.C26H31N3O3
Mol. Mass.433.5426
SMILESN[C@H]1CC[C@H](CNC(=O)[C@@H]2CCCN2C(=O)C2(O)c3ccccc3-c3ccccc23)CC1