Reaction Details
TargetCannabinoid receptor 1
LigandBDBM50164430
Substrate/Competitorn/a
Meas. Tech.ChEMBL_302943 (CHEMBL841778)
Ki 1820±n/a nM
Citation Muccioli, GGMartin, DScriba, GKPoppitz, WPoupaert, JHWouters, JLambert, DM Substituted 5,5'-diphenyl-2-thioxoimidazolidin-4-one as CB1 cannabinoid receptor ligands: synthesis and pharmacological evaluation. J Med Chem48:2509-17 (2005) 
 
Cannabinoid receptor 1
Name:Cannabinoid receptor 1
Type:G Protein-Coupled Receptor (GPCR)
Mol. Mass.:52868.96
Organism:Homo sapiens (Human)
Description:P21554
Residue:472
BDBM50164430
NameBDBM50164430
Synonyms:3-Butyl-5,5-bis-(4-iodo-phenyl)-imidazolidine-2,4-dione | CHEMBL426455
TypeSmall organic molecule
Emp. Form.C19H18I2N2O2
Mol. Mass.560.1674
SMILESCCCCN1C(=O)NC(C1=O)(c1ccc(I)cc1)c1ccc(I)cc1