Reaction Details
TargetCannabinoid receptor 1
LigandBDBM50164438
Substrate/Competitorn/a
Meas. Tech.ChEMBL_302943 (CHEMBL841778)
Ki 2089±n/a nM
Citation Muccioli, GGMartin, DScriba, GKPoppitz, WPoupaert, JHWouters, JLambert, DM Substituted 5,5'-diphenyl-2-thioxoimidazolidin-4-one as CB1 cannabinoid receptor ligands: synthesis and pharmacological evaluation. J Med Chem48:2509-17 (2005) 
 
Cannabinoid receptor 1
Name:Cannabinoid receptor 1
Type:G Protein-Coupled Receptor (GPCR)
Mol. Mass.:52868.96
Organism:Homo sapiens (Human)
Description:P21554
Residue:472
BDBM50164438
NameBDBM50164438
Synonyms:5,5-Bis-(4-chloro-phenyl)-3-isobutyl-2-thioxo-imidazolidin-4-one | CHEMBL195396
TypeSmall organic molecule
Emp. Form.C19H18Cl2N2OS
Mol. Mass.393.33
SMILESCC(C)CN1C(=S)NC(C1=O)(c1ccc(Cl)cc1)c1ccc(Cl)cc1