Reaction Details
TargetGlutamate receptor ionotropic, NMDA 1/2A
LigandBDBM50164550
Substrate/Competitorn/a
Meas. Tech.ChEMBL_303758 (CHEMBL829801)
Ki 8780.0±n/a nM
Citation Morley, RMTse, HWFeng, BMiller, JCMonaghan, DTJane, DE Synthesis and pharmacology of N1-substituted piperazine-2,3-dicarboxylic acid derivatives acting as NMDA receptor antagonists. J Med Chem48:2627-37 (2005) 
 
Glutamate receptor ionotropic, NMDA 1/2A
Name:Glutamate receptor ionotropic, NMDA 1/2A
Type:n/a
Mol. Mass.:n/a
Description:ASSAY_ID of EBI is 141020
Components:This complex has 2 components.
Component 1
Name:Glutamate receptor ionotropic, NMDA 2A
Synonyms:Glutamate NMDA receptor; Grin1/Grin2a Grin2a NMDE1_RAT
Type:Protein
Mol. Mass.:165478.25
Organism:Rattus norvegicus (Rat)
Description:Q00959
Residue:1464
Component 2
Name:Glutamate receptor ionotropic, NMDA 1
Synonyms:Glutamate (NMDA) receptor subunit zeta 1 Glutamate-NMDA-Channel Glutamate-NMDA-Polyamine NMDA Nmdar1 | phencyclidine
Type:Enzyme Catalytic Domain
Mol. Mass.:105533.40
Organism:RAT
Description:P35439
Residue:938
BDBM50164550
NameBDBM50164550
Synonyms:(2R,3S)-1-(4'-Fluoro-biphenyl-4-carbonyl)-piperazine-2,3-dicarboxylic acid | CHEMBL372278
TypeSmall organic molecule
Emp. Form.C19H17FN2O5
Mol. Mass.372.3471
SMILESOC(=O)[C@H]1NCCN([C@H]1C(O)=O)C(=O)c1ccc(cc1)-c1ccc(F)cc1