Reaction Details
TargetGenome polyprotein
LigandBDBM50410369
Substrate/Competitorn/a
Meas. Tech.ChEMBL_308168 (CHEMBL834971)
IC50 794.33±n/a nM
Citation Fontaine, FPastor, MZamora, ISanz, F Anchor-GRIND: filling the gap between standard 3D QSAR and the GRid-INdependent descriptors. J Med Chem48:2687-94 (2005) 
 
Genome polyprotein
Name:Genome polyprotein
Type:Protein
Mol. Mass.:327266.82
Organism:Hepatitis C virus (HCV)
Description:P26664
Residue:3011
BDBM50410369
NameBDBM50410369
Synonyms:CHEMBL363650
TypeSmall organic molecule
Emp. Form.C36H47N3O8
Mol. Mass.649.7737
SMILESCOc1ccc2c(O[C@@H]3C[C@H](C(C3)C(=O)[C@@H](NC(=O)[C@@H](NC(C)=O)C3CCCCC3)C(C)C)C(=O)CC3(CC3)C(O)=O)ccnc2c1