Reaction Details
TargetCystic fibrosis transmembrane conductance regulator
LigandBDBM50164971
Substrate/Competitorn/a
Meas. Tech.ChEMBL_310547 (CHEMBL833631)
EC50 145±n/a nM
Citation Hirth, BHQiao, SCuff, LMCochran, BMPregel, MJGregory, JSSneddon, SFKane, JL Discovery of 1,2,3,4-tetrahydroisoquinoline-3-carboxylic acid diamides that increase CFTR mediated chloride transport. Bioorg Med Chem Lett15:2087-91 (2005) 
 
Cystic fibrosis transmembrane conductance regulator
Name:Cystic fibrosis transmembrane conductance regulator
Type:Enzyme Catalytic Domain
Mol. Mass.:168171.30
Organism:Homo sapiens (Human)
Description:gi_90421313
Residue:1480
BDBM50164971
NameBDBM50164971
Synonyms:(R)-2-(3-Phenoxy-benzoyl)-1,2,3,4-tetrahydro-isoquinoline-3-carboxylic acid (4-butoxy-phenyl)-amide | CHEMBL370964
TypeSmall organic molecule
Emp. Form.C33H32N2O4
Mol. Mass.520.6182
SMILESCCCCOc1ccc(NC(=O)[C@H]2Cc3ccccc3CN2C(=O)c2cccc(Oc3ccccc3)c2)cc1