Reaction Details
TargetCystic fibrosis transmembrane conductance regulator
LigandBDBM50164972
Substrate/Competitorn/a
Meas. Tech.ChEMBL_310547 (CHEMBL833631)
EC50 291±n/a nM
Citation Hirth, BHQiao, SCuff, LMCochran, BMPregel, MJGregory, JSSneddon, SFKane, JL Discovery of 1,2,3,4-tetrahydroisoquinoline-3-carboxylic acid diamides that increase CFTR mediated chloride transport. Bioorg Med Chem Lett15:2087-91 (2005) 
 
Cystic fibrosis transmembrane conductance regulator
Name:Cystic fibrosis transmembrane conductance regulator
Type:Enzyme Catalytic Domain
Mol. Mass.:168171.30
Organism:Homo sapiens (Human)
Description:gi_90421313
Residue:1480
BDBM50164972
NameBDBM50164972
Synonyms:(R)-2-(3-Benzyl-benzoyl)-1,2,3,4-tetrahydro-isoquinoline-3-carboxylic acid (4-chloro-phenyl)-amide | CHEMBL434733
TypeSmall organic molecule
Emp. Form.C30H25ClN2O2
Mol. Mass.480.985
SMILESClc1ccc(NC(=O)[C@H]2Cc3ccccc3CN2C(=O)c2cccc(Cc3ccccc3)c2)cc1