Reaction Details
TargetMuscarinic acetylcholine receptor M3
LigandBDBM50165020
Substrate/Competitorn/a
Meas. Tech.ChEMBL_302413 (CHEMBL828817)
Ki 39±n/a nM
Citation Kaur, KAeron, SBruhaspathy, MShetty, SJGupta, SHegde, LHSilamkoti, ADMehta, AChugh, AGupta, JBSarma, PKKumar, N Design, synthesis and activity of novel derivatives of oxybutynin and tolterodine. Bioorg Med Chem Lett15:2093-6 (2005) 
 
Muscarinic acetylcholine receptor M3
Name:Muscarinic acetylcholine receptor M3
Type:Enzyme Catalytic Domain
Mol. Mass.:66086.66
Organism:RAT
Description:Cholinergic, muscarinic M3 CHRM3 RAT::P08483
Residue:589
BDBM50165020
NameBDBM50165020
Synonyms:Bis-(4-fluoro-phenyl)-hydroxy-acetic acid 4-(3-aza-bicyclo[3.1.0]hex-3-yl)-but-2-ynyl ester | CHEMBL192337
TypeSmall organic molecule
Emp. Form.C23H21F2NO3
Mol. Mass.397.4145
SMILESOC(C(=O)OCC#CCN1CC2CC2C1)(c1ccc(F)cc1)c1ccc(F)cc1