Reaction Details
TargetAdenosine receptor A2a
LigandBDBM50165061
Substrate/Competitorn/a
Meas. Tech.ChEMBL_303597 (CHEMBL829686)
Ki 10±n/a nM
Citation Kiselgof, ETulshian, DBArik, LZhang, HFawzi, A 6-(2-Furanyl)-9H-purin-2-amine derivatives as A2A adenosine antagonists. Bioorg Med Chem Lett15:2119-22 (2005) 
 
Adenosine receptor A2a
Name:Adenosine receptor A2a
Type:G Protein-Coupled Receptor (GPCR)
Mol. Mass.:44716.46
Organism:Homo sapiens (Human)
Description:P29274
Residue:412
BDBM50165061
NameBDBM50165061
Synonyms:6-Furan-2-yl-9-(4-isopropyl-benzyl)-9H-purin-2-ylamine | CHEMBL195294
TypeSmall organic molecule
Emp. Form.C19H19N5O
Mol. Mass.333.3871
SMILESCC(C)c1ccc(Cn2cnc3c(nc(N)nc23)-c2ccco2)cc1