Reaction Details
TargetAdenosine receptor A2a
LigandBDBM50165070
Substrate/Competitorn/a
Meas. Tech.ChEMBL_303597 (CHEMBL829686)
Ki 8.7±n/a nM
Citation Kiselgof, ETulshian, DBArik, LZhang, HFawzi, A 6-(2-Furanyl)-9H-purin-2-amine derivatives as A2A adenosine antagonists. Bioorg Med Chem Lett15:2119-22 (2005) 
 
Adenosine receptor A2a
Name:Adenosine receptor A2a
Type:G Protein-Coupled Receptor (GPCR)
Mol. Mass.:44716.46
Organism:Homo sapiens (Human)
Description:P29274
Residue:412
BDBM50165070
NameBDBM50165070
Synonyms:9-(3-Fluoro-4-trifluoromethyl-benzyl)-6-furan-2-yl-9H-purin-2-ylamine | CHEMBL197148
TypeSmall organic molecule
Emp. Form.C17H11F4N5O
Mol. Mass.377.2958
SMILESNc1nc(-c2ccco2)c2ncn(Cc3ccc(c(F)c3)C(F)(F)F)c2n1