Reaction Details
TargetDelta-type opioid receptor
LigandBDBM50370067
Substrate/Competitorn/a
Meas. Tech.ChEMBL_2204089 (CHEMBL5116797)
Ki 2.5±n/a nM
Citation Zampieri, DFortuna, SRomano, MAmata, EDichiara, MMarrazzo, APasquinucci, LTurnaturi, RMamolo, MG Design, synthesis and biological evaluation of novel aminopropylcarboxamide derivatives as sigma ligands. Bioorg Med Chem Lett72:0 (2022) 
 
Delta-type opioid receptor
Name:Delta-type opioid receptor
Type:G Protein-Coupled Receptor (GPCR)
Mol. Mass.:40382.98
Organism:Homo sapiens (Human)
Description:Competition binding assays were carried out using membrane preparations from transfected HN9.10 cells that constitutively expressed the delta opioid receptor.
Residue:372
BDBM50370067
NameBDBM50370067
Synonyms:CHEMBL1237164
TypeSmall organic molecule
Emp. Form.C26H26N2O3
Mol. Mass.414.4962
SMILESOc1ccc2C[C@H]3N(CC4CC4)CC[C@@]45[C@@H](Oc1c24)c1[nH]c2ccccc2c1C[C@@]35O