Reaction Details
TargetHeat shock protein HSP 90-alpha
LigandBDBM50165264
Substrate/Competitorn/a
Meas. Tech.ChEMBL_304223 (CHEMBL828939)
EC50 26700±n/a nM
Citation Llauger, LHe, HKim, JAguirre, JRosen, NPeters, UDavies, PChiosis, G Evaluation of 8-arylsulfanyl, 8-arylsulfoxyl, and 8-arylsulfonyl adenine derivatives as inhibitors of the heat shock protein 90. J Med Chem48:2892-905 (2005) 
 
Heat shock protein HSP 90-alpha
Name:Heat shock protein HSP 90-alpha
Type:Molecular Chaperone
Mol. Mass.:84623.45
Organism:Homo sapiens (Human)
Description:P07900
Residue:732
BDBM50165264
NameBDBM50165264
Synonyms:8-(2-Chloro-3,4,5-trimethoxy-phenylsulfanyl)-2-fluoro-9-(2-isopropoxy-ethyl)-9H-purin-6-ylamine | CHEMBL191786
TypeSmall organic molecule
Emp. Form.C19H23ClFN5O4S
Mol. Mass.471.933
SMILESCOc1cc(Sc2nc3c(N)nc(F)nc3n2CCOC(C)C)c(Cl)c(OC)c1OC