Reaction Details
TargetPoly [ADP-ribose] polymerase 1
LigandBDBM50165472
Substrate/Competitorn/a
Meas. Tech.ChEMBL_305621 (CHEMBL829484)
IC50 19±n/a nM
Citation Loh, VMCockcroft, XLDillon, KJDixon, LDrzewiecki, JEversley, PJGomez, SHoare, JKerrigan, FMatthews, ITMenear, KAMartin, NMNewton, RFPaul, JSmith, GCVile, JWhittle, AJ Phthalazinones. Part 1: The design and synthesis of a novel series of potent inhibitors of poly(ADP-ribose)polymerase. Bioorg Med Chem Lett15:2235-8 (2005) 
 
Poly [ADP-ribose] polymerase 1
Name:Poly [ADP-ribose] polymerase 1
Type:n/a
Mol. Mass.:113114.22
Organism:Homo sapiens (Human)
Description:P09874
Residue:1014
BDBM50165472
NameBDBM50165472
Synonyms:1-(2-chloro-5-((4-oxo-3,4-dihydrophthalazin-1-yl)methyl)phenyl)pyrrolidine-2,5-dione CHEMBL195913
TypeSmall organic molecule
Emp. Form.C19H14ClN3O3
Mol. Mass.367.786
SMILESOc1ccc(O)n1-c1cc(Cc2n[nH]c(=O)c3ccccc23)ccc1Cl