Reaction Details
TargetPoly [ADP-ribose] polymerase 1
LigandBDBM50240980
Substrate/Competitorn/a
Meas. Tech.ChEMBL_305621 (CHEMBL829484)
IC50 56±n/a nM
Citation Loh, VMCockcroft, XLDillon, KJDixon, LDrzewiecki, JEversley, PJGomez, SHoare, JKerrigan, FMatthews, ITMenear, KAMartin, NMNewton, RFPaul, JSmith, GCVile, JWhittle, AJ Phthalazinones. Part 1: The design and synthesis of a novel series of potent inhibitors of poly(ADP-ribose)polymerase. Bioorg Med Chem Lett15:2235-8 (2005) 
 
Poly [ADP-ribose] polymerase 1
Name:Poly [ADP-ribose] polymerase 1
Type:n/a
Mol. Mass.:113114.22
Organism:Homo sapiens (Human)
Description:P09874
Residue:1014
BDBM50240980
NameBDBM50240980
Synonyms:CHEMBL372450 [2,3']Bithiophenyl-5-carboxylic acid [3-(4-oxo-3,4-dihydro-phthalazin-1-ylmethyl)-phenyl]-amide
TypeSmall organic molecule
Emp. Form.C24H17N3O2S2
Mol. Mass.443.541
SMILESO=C(Nc1cccc(Cc2n[nH]c(=O)c3ccccc23)c1)c1ccc(s1)-c1ccsc1