Reaction Details
TargetPoly [ADP-ribose] polymerase 1
LigandBDBM50165480
Substrate/Competitorn/a
Meas. Tech.ChEMBL_305621 (CHEMBL829484)
IC50 27±n/a nM
Citation Loh, VMCockcroft, XLDillon, KJDixon, LDrzewiecki, JEversley, PJGomez, SHoare, JKerrigan, FMatthews, ITMenear, KAMartin, NMNewton, RFPaul, JSmith, GCVile, JWhittle, AJ Phthalazinones. Part 1: The design and synthesis of a novel series of potent inhibitors of poly(ADP-ribose)polymerase. Bioorg Med Chem Lett15:2235-8 (2005) 
 
Poly [ADP-ribose] polymerase 1
Name:Poly [ADP-ribose] polymerase 1
Type:n/a
Mol. Mass.:113114.22
Organism:Homo sapiens (Human)
Description:P09874
Residue:1014
BDBM50165480
NameBDBM50165480
Synonyms:4-Methyl-2-phenyl-thiazole-5-carboxylic acid [3-(4-oxo-3,4-dihydro-phthalazin-1-ylmethyl)-phenyl]-amide | CHEMBL383578
TypeSmall organic molecule
Emp. Form.C26H20N4O2S
Mol. Mass.452.528
SMILESCc1nc(sc1C(=O)Nc1cccc(Cc2n[nH]c(=O)c3ccccc23)c1)-c1ccccc1