Reaction Details
TargetPoly [ADP-ribose] polymerase 1
LigandBDBM50165492
Substrate/Competitorn/a
Meas. Tech.ChEMBL_305621 (CHEMBL829484)
IC50 9.5±n/a nM
Citation Loh, VMCockcroft, XLDillon, KJDixon, LDrzewiecki, JEversley, PJGomez, SHoare, JKerrigan, FMatthews, ITMenear, KAMartin, NMNewton, RFPaul, JSmith, GCVile, JWhittle, AJ Phthalazinones. Part 1: The design and synthesis of a novel series of potent inhibitors of poly(ADP-ribose)polymerase. Bioorg Med Chem Lett15:2235-8 (2005) 
 
Poly [ADP-ribose] polymerase 1
Name:Poly [ADP-ribose] polymerase 1
Type:n/a
Mol. Mass.:113114.22
Organism:Homo sapiens (Human)
Description:P09874
Residue:1014
BDBM50165492
NameBDBM50165492
Synonyms:1-[2-Fluoro-5-(4-oxo-3,4-dihydro-phthalazin-1-ylmethyl)-phenyl]-4-methyl-piperazine-2,6-dione | CHEMBL195966
TypeSmall organic molecule
Emp. Form.C20H17FN4O3
Mol. Mass.380.3724
SMILESCN1CC(=O)N(C(=O)C1)c1cc(Cc2n[nH]c(=O)c3ccccc23)ccc1F