Reaction Details
TargetHeparanase
LigandBDBM50165652
Substrate/Competitorn/a
Meas. Tech.ChEMBL_305497 (CHEMBL831099)
IC50 400±n/a nM
Citation Courtney, SMHay, PABuck, RTColville, CSPhillips, DJScopes, DIPollard, FCPage, MJBennett, JMHircock, MLMcKenzie, EABhaman, MFelix, RStubberfield, CRTurner, PR Furanyl-1,3-thiazol-2-yl and benzoxazol-5-yl acetic acid derivatives: novel classes of heparanase inhibitor. Bioorg Med Chem Lett15:2295-9 (2005) 
 
Heparanase
Name:Heparanase
Type:PROTEIN
Mol. Mass.:61167.67
Organism:Homo sapiens (Human)
Description:ChEMBL_327900
Residue:543
BDBM50165652
NameBDBM50165652
Synonyms:(2-{4-[3-((E)-4-Bromo-phenyl)-acryloylamino]-3-fluoro-phenyl}-benzooxazol-5-yl)-acetic acid CHEMBL196875 | US11718609, Compound OGT_2115
TypeSmall organic molecule
Emp. Form.C24H16BrFN2O4
Mol. Mass.495.297
SMILESOC(=O)Cc1ccc2oc(nc2c1)-c1ccc(NC(=O)\C=C\c2ccc(Br)cc2)c(F)c1