Reaction Details
Target72 kDa type IV collagenase
LigandBDBM50592894
Substrate/Competitorn/a
Meas. Tech.ChEMBL_2206237 (CHEMBL5118945)
IC50 0.050000±n/a nM
Citation Baidya, SKBanerjee, SAdhikari, NJha, T Selective Inhibitors of Medium-Size S1' Pocket Matrix Metalloproteinases: A Stepping Stone of Future Drug Discovery. J Med Chem65:10709-10754 (2022) 
 
72 kDa type IV collagenase
Name:72 kDa type IV collagenase
Type:Enzyme
Mol. Mass.:73870.36
Organism:Homo sapiens (Human)
Description: P08253
Residue:660
BDBM50592894
NameBDBM50592894
Synonyms:CHEMBL473539
TypeSmall organic molecule
Emp. Form.C19H22N2O5S2
Mol. Mass.422.518
SMILESCC1(C)SCCN([C@H]1C(=O)NO)S(=O)(=O)c1ccc(Oc2ccccc2)cc1