Reaction Details
TargetMatrix metalloproteinase-14
LigandBDBM50592893
Substrate/Competitorn/a
Meas. Tech.ChEMBL_2206244 (CHEMBL5118952)
IC50 3.0±n/a nM
Citation Baidya, SKBanerjee, SAdhikari, NJha, T Selective Inhibitors of Medium-Size S1' Pocket Matrix Metalloproteinases: A Stepping Stone of Future Drug Discovery. J Med Chem65:10709-10754 (2022) 
 
Matrix metalloproteinase-14
Name:Matrix metalloproteinase-14
Type:Protein
Mol. Mass.:65900.19
Organism:Homo sapiens (Human)
Description:P50281
Residue:582
BDBM50592893
NameBDBM50592893
Synonyms:CHEMBL5205063
TypeSmall organic molecule
Emp. Form.C24H32N2O4S2
Mol. Mass.476.652
SMILESCNC(=O)[C@@H](CC(=O)[C@H](CC(C)C)[C@H](CSc1cccs1)C(=O)NO)Cc1ccccc1