Reaction Details
TargetEphrin type-B receptor 2
LigandBDBM50095227
Substrate/Competitorn/a
Meas. Tech.ChEMBL_302212 (CHEMBL826985)
Kd 58400±n/a nM
Citation Toledo-Sherman, LDeretey, ESlon-Usakiewicz, JJNg, WDai, JRFoster, JERedden, PRUger, MDLiao, LCPasternak, AReid, N Frontal affinity chromatography with MS detection of EphB2 tyrosine kinase receptor. 2. Identification of small-molecule inhibitors via coupling with virtual screening. J Med Chem48:3221-30 (2005) 
 
Ephrin type-B receptor 2
Name:Ephrin type-B receptor 2
Type:PROTEIN
Mol. Mass.:117491.44
Organism:Homo sapiens (Human)
Description:ChEMBL_1476221
Residue:1055
BDBM50095227
NameBDBM50095227
Synonyms:(6,7-Dimethoxy-quinazolin-4-yl)-(4-phenoxy-phenyl)-amine CHEMBL97771 | US10548897, Compound 2
TypeSmall organic molecule
Emp. Form.C22H19N3O3
Mol. Mass.373.4046
SMILESCOc1cc2ncnc(Nc3ccc(Oc4ccccc4)cc3)c2cc1OC