Reaction Details
TargetEphrin type-B receptor 2
LigandBDBM50166044
Substrate/Competitorn/a
Meas. Tech.ChEMBL_304919 (CHEMBL827811)
IC50 88000±n/a nM
Citation Toledo-Sherman, LDeretey, ESlon-Usakiewicz, JJNg, WDai, JRFoster, JERedden, PRUger, MDLiao, LCPasternak, AReid, N Frontal affinity chromatography with MS detection of EphB2 tyrosine kinase receptor. 2. Identification of small-molecule inhibitors via coupling with virtual screening. J Med Chem48:3221-30 (2005) 
 
Ephrin type-B receptor 2
Name:Ephrin type-B receptor 2
Type:PROTEIN
Mol. Mass.:117491.44
Organism:Homo sapiens (Human)
Description:ChEMBL_1476221
Residue:1055
BDBM50166044
NameBDBM50166044
Synonyms:4-Chloro-N-(2-phenyl-imidazo[1,2-a]pyrimidin-3-yl)-benzamide | CHEMBL426989
TypeSmall organic molecule
Emp. Form.C19H13ClN4O
Mol. Mass.348.786
SMILESClc1ccc(cc1)C(=O)Nc1c(nc2ncccn12)-c1ccccc1