Reaction Details
TargetEphrin type-B receptor 2
LigandBDBM50111603
Substrate/Competitorn/a
Meas. Tech.ChEMBL_304919 (CHEMBL827811)
IC50 27500±n/a nM
Citation Toledo-Sherman, LDeretey, ESlon-Usakiewicz, JJNg, WDai, JRFoster, JERedden, PRUger, MDLiao, LCPasternak, AReid, N Frontal affinity chromatography with MS detection of EphB2 tyrosine kinase receptor. 2. Identification of small-molecule inhibitors via coupling with virtual screening. J Med Chem48:3221-30 (2005) 
 
Ephrin type-B receptor 2
Name:Ephrin type-B receptor 2
Type:PROTEIN
Mol. Mass.:117491.44
Organism:Homo sapiens (Human)
Description:ChEMBL_1476221
Residue:1055
BDBM50111603
NameBDBM50111603
Synonyms:3-(4-(dimethylamino)benzylidene)indolin-2-one 3-[1-(4-Dimethylamino-phenyl)-meth-(E)-ylidene]-1,3-dihydro-indol-2-one SU-4312 US9422297, DMBI
TypeSmall organic molecule
Emp. Form.C17H16N2O
Mol. Mass.264.3217
SMILESCN(C)c1ccc(\C=C2\C(=O)Nc3ccccc23)cc1