Reaction Details
TargetEphrin type-B receptor 2
LigandBDBM3570
Substrate/Competitorn/a
Meas. Tech.ChEMBL_304919 (CHEMBL827811)
IC50 22000±n/a nM
Citation Toledo-Sherman, LDeretey, ESlon-Usakiewicz, JJNg, WDai, JRFoster, JERedden, PRUger, MDLiao, LCPasternak, AReid, N Frontal affinity chromatography with MS detection of EphB2 tyrosine kinase receptor. 2. Identification of small-molecule inhibitors via coupling with virtual screening. J Med Chem48:3221-30 (2005) 
 
Ephrin type-B receptor 2
Name:Ephrin type-B receptor 2
Type:PROTEIN
Mol. Mass.:117491.44
Organism:Homo sapiens (Human)
Description:ChEMBL_1476221
Residue:1055
BDBM3570
NameBDBM3570
Synonyms:8-[(3-Bromophenyl)amino]-1H-imidazo[4,5-g]quinazoline CHEMBL66031 N-(3-bromophenyl)-1H-imidazo[4,5-g]quinazolin-8-amine
TypeSmall organic molecule
Emp. Form.C15H10BrN5
Mol. Mass.340.177
SMILESBrc1cccc(Nc2ncnc3cc4nc[nH]c4cc23)c1