Reaction Details
TargetMu-type opioid receptor
LigandBDBM50060070
Substrate/Competitorn/a
Meas. Tech.ChEMBL_303703 (CHEMBL829038)
Ki 0.31±n/a nM
Citation Martinek, TAOtvös, FDervarics, MTóth, GFülöp, F Ligand-based prediction of active conformation by 3D-QSAR flexibility descriptors and their application in 3+3D-QSAR models. J Med Chem48:3239-50 (2005) 
 
Mu-type opioid receptor
Name:Mu-type opioid receptor
Type:G Protein-Coupled Receptor (GPCR)
Mol. Mass.:44503.11
Organism:Rattus norvegicus (rat)
Description:Competition binding assays were carried out using membrane preparations from transfected HN9.10 cells that constitutively expressed the mu opioid receptor.
Residue:398
BDBM50060070
NameBDBM50060070
Synonyms:(S)-2-Amino-N-{(R)-1-[(S)-1-((S)-1-carbamoyl-2-phenyl-ethylcarbamoyl)-2-phenyl-ethylcarbamoyl]-ethyl}-3-(4-hydroxy-phenyl)-propionamide CHEMBL317264 | Tyr-d-Ala-Phe-Phe-NH2
TypeSmall organic molecule
Emp. Form.C30H35N5O5
Mol. Mass.545.6294
SMILESC[C@@H](NC(=O)[C@@H](N)Cc1ccc(O)cc1)C(=O)N[C@@H](Cc1ccccc1)C(=O)N[C@@H](Cc1ccccc1)C(N)=O