Reaction Details
TargetGlutamate receptor 1
LigandBDBM50166288
Substrate/Competitorn/a
Meas. Tech.ChEMBL_303109 (CHEMBL829619)
Ki 5.22±n/a nM
Citation Vogensen, SBClausen, RPGreenwood, JRJohansen, TNPickering, DSNielsen, BEbert, BKrogsgaard-Larsen, P Convergent synthesis and pharmacology of substituted tetrazolyl-2-amino-3-(3-hydroxy-5-methyl-4-isoxazolyl)propionic acid analogues. J Med Chem48:3438-42 (2005) 
 
Glutamate receptor 1
Name:Glutamate receptor 1
Type:Enzyme Catalytic Domain
Mol. Mass.:101512.92
Organism:Homo sapiens (Human)
Description:Glutamate AMPA 1 GRIA1 HUMAN::P42261
Residue:906
BDBM50166288
NameBDBM50166288
Synonyms:(S)-2-Amino-3-[3-hydroxy-5-(2-methyl-2H-tetrazol-5-yl)-isoxazol-4-yl]-propionic acid CHEMBL370038
TypeSmall organic molecule
Emp. Form.C8H10N6O4
Mol. Mass.254.2028
SMILESCn1nnc(n1)-c1o[nH]c(=O)c1C[C@H](N)C(O)=O