Reaction Details
TargetDipeptidyl peptidase 4
LigandBDBM50166307
Substrate/Competitorn/a
Meas. Tech.ChEMBL_305151 (CHEMBL876981)
IC50 5.5±n/a nM
Citation Sakashita, HKitajima, HNakamura, MAkahoshi, FHayashi, Y 1-((S)-gamma-substituted prolyl)-(S)-2-cyanopyrrolidine as a novel series of highly potent DPP-IV inhibitors. Bioorg Med Chem Lett15:2441-5 (2005) 
 
Dipeptidyl peptidase 4
Name:Dipeptidyl peptidase 4
Type:Enzyme
Mol. Mass.:88271.01
Organism:Homo sapiens (Human)
Description:P27487
Residue:766
BDBM50166307
NameBDBM50166307
Synonyms:CHEMBL539939 | N-[(3S,5S)-5-((S)-2-Cyano-pyrrolidine-1-carbonyl)-pyrrolidin-3-yl]-benzamide
TypeSmall organic molecule
Emp. Form.C17H20N4O2
Mol. Mass.312.3663
SMILESO=C(N[C@@H]1CN[C@@H](C1)C(=O)N1CCC[C@H]1C#N)c1ccccc1