Reaction Details
TargetDipeptidyl peptidase 4
LigandBDBM50166318
Substrate/Competitorn/a
Meas. Tech.ChEMBL_305151 (CHEMBL876981)
IC50 0.13±n/a nM
Citation Sakashita, HKitajima, HNakamura, MAkahoshi, FHayashi, Y 1-((S)-gamma-substituted prolyl)-(S)-2-cyanopyrrolidine as a novel series of highly potent DPP-IV inhibitors. Bioorg Med Chem Lett15:2441-5 (2005) 
 
Dipeptidyl peptidase 4
Name:Dipeptidyl peptidase 4
Type:Enzyme
Mol. Mass.:88271.01
Organism:Homo sapiens (Human)
Description:P27487
Residue:766
BDBM50166318
NameBDBM50166318
Synonyms:(S)-1-[(2S,4S)-4-(3-Chloro-4-cyano-phenylamino)-pyrrolidine-2-carbonyl]-pyrrolidine-2-carbonitrile | CHEMBL194717
TypeSmall organic molecule
Emp. Form.C17H18ClN5O
Mol. Mass.343.811
SMILESClc1cc(N[C@@H]2CN[C@@H](C2)C(=O)N2CCC[C@H]2C#N)ccc1C#N