Reaction Details
TargetDipeptidyl peptidase 4
LigandBDBM50166321
Substrate/Competitorn/a
Meas. Tech.ChEMBL_305067 (CHEMBL832699)
IC50 3±n/a nM
Citation Sakashita, HKitajima, HNakamura, MAkahoshi, FHayashi, Y 1-((S)-gamma-substituted prolyl)-(S)-2-cyanopyrrolidine as a novel series of highly potent DPP-IV inhibitors. Bioorg Med Chem Lett15:2441-5 (2005) 
 
Dipeptidyl peptidase 4
Name:Dipeptidyl peptidase 4
Type:Enzyme
Mol. Mass.:88084.94
Organism:Rattus norvegicus (rat)
Description:n/a
Residue:767
BDBM50166321
NameBDBM50166321
Synonyms:(S)-1-((2S,4S)-4-Benzylamino-pyrrolidine-2-carbonyl)-pyrrolidine-2-carbonitrile | CHEMBL195804
TypeSmall organic molecule
Emp. Form.C17H22N4O
Mol. Mass.298.3828
SMILESO=C([C@@H]1C[C@@H](CN1)NCc1ccccc1)N1CCC[C@H]1C#N