Reaction Details
TargetDipeptidyl peptidase 4
LigandBDBM50166315
Substrate/Competitorn/a
Meas. Tech.ChEMBL_305151 (CHEMBL876981)
IC50 0.25±n/a nM
Citation Sakashita, HKitajima, HNakamura, MAkahoshi, FHayashi, Y 1-((S)-gamma-substituted prolyl)-(S)-2-cyanopyrrolidine as a novel series of highly potent DPP-IV inhibitors. Bioorg Med Chem Lett15:2441-5 (2005) 
 
Dipeptidyl peptidase 4
Name:Dipeptidyl peptidase 4
Type:Enzyme
Mol. Mass.:88271.01
Organism:Homo sapiens (Human)
Description:P27487
Residue:766
BDBM50166315
NameBDBM50166315
Synonyms:6-((3S,5S)-5-((S)-2-cyanopyrrolidine-1-carbonyl)pyrrolidin-3-ylamino)nicotinonitrile CHEMBL195420
TypeSmall organic molecule
Emp. Form.C16H18N6O
Mol. Mass.310.3537
SMILESO=C([C@@H]1C[C@@H](CN1)Nc1ccc(cn1)C#N)N1CCC[C@H]1C#N