Reaction Details
TargetDipeptidyl peptidase 4
LigandBDBM50166313
Substrate/Competitorn/a
Meas. Tech.ChEMBL_305067 (CHEMBL832699)
IC50 3.9±n/a nM
Citation Sakashita, HKitajima, HNakamura, MAkahoshi, FHayashi, Y 1-((S)-gamma-substituted prolyl)-(S)-2-cyanopyrrolidine as a novel series of highly potent DPP-IV inhibitors. Bioorg Med Chem Lett15:2441-5 (2005) 
 
Dipeptidyl peptidase 4
Name:Dipeptidyl peptidase 4
Type:Enzyme
Mol. Mass.:88084.94
Organism:Rattus norvegicus (rat)
Description:n/a
Residue:767
BDBM50166313
NameBDBM50166313
Synonyms:CHEMBL193168 | N-[(3S,5S)-5-((S)-2-Cyano-pyrrolidine-1-carbonyl)-pyrrolidin-3-yl]-benzenesulfonamide
TypeSmall organic molecule
Emp. Form.C16H20N4O3S
Mol. Mass.348.42
SMILESO=C([C@@H]1C[C@@H](CN1)NS(=O)(=O)c1ccccc1)N1CCC[C@H]1C#N