Reaction Details
TargetDipeptidyl peptidase 4
LigandBDBM11113
Substrate/Competitorn/a
Meas. Tech.ChEMBL_305151 (CHEMBL876981)
IC50 1.4±n/a nM
Citation Sakashita, HKitajima, HNakamura, MAkahoshi, FHayashi, Y 1-((S)-gamma-substituted prolyl)-(S)-2-cyanopyrrolidine as a novel series of highly potent DPP-IV inhibitors. Bioorg Med Chem Lett15:2441-5 (2005) 
 
Dipeptidyl peptidase 4
Name:Dipeptidyl peptidase 4
Type:Enzyme
Mol. Mass.:88271.01
Organism:Homo sapiens (Human)
Description:P27487
Residue:766
BDBM11113
NameBDBM11113
Synonyms:6-{[2-({2-[(2S)-2-cyanopyrrolidin-1-yl]-2-oxoethyl}amino)ethyl]amino}pyridine-3-carbonitrile CHEMBL77538 cyano-(S)-pyrrolidine deriv. 1 | cyanopyrrolidine derivative 2
TypeSmall organic molecule
Emp. Form.C15H18N6O
Mol. Mass.298.343
SMILESO=C(CNCCNc1ccc(cn1)C#N)N1CCC[C@H]1C#N