Reaction Details
TargetDelta-type opioid receptor
LigandBDBM50166347
Substrate/Competitorn/a
Meas. Tech.ChEMBL_303398 (CHEMBL840061)
Ki 10.4±n/a nM
Citation Sperlinga, EKosson, PUrbanczyk-Lipkowska, ZRonsisvalle, GCarr, DBLipkowski, AW 6-Hydroxy-1,2,3,4-tetrahydro-isoquinoline-3-carboxylic acid mimics active conformation of tyrosine in opioid peptides. Bioorg Med Chem Lett15:2467-9 (2005) 
 
Delta-type opioid receptor
Name:Delta-type opioid receptor
Type:G Protein-Coupled Receptor (GPCR)
Mol. Mass.:40465.04
Organism:Rattus norvegicus (rat)
Description:Competition binding assays were using CHO-K1 cell membranes expressing the opioid receptor.
Residue:372
BDBM50166347
NameBDBM50166347
Synonyms:(S)-N-{(S)-1-[(S)-1-(Carbamoylmethyl-carbamoyl)-2-methyl-propylcarbamoyl]-2-methyl-propyl}-3-((S)-2-{(R)-2-[((S)-6-hydroxy-1,2,3,4-tetrahydro-isoquinoline-3-carbonyl)-amino]-propionylamino}-3-phenyl-propionylamino)-succinamic acid | CHEMBL191777
TypeSmall organic molecule
Emp. Form.C38H52N8O10
Mol. Mass.780.8671
SMILESCC(C)[C@H](NC(=O)[C@@H](NC(=O)[C@H](CC(O)=O)NC(=O)[C@H](Cc1ccccc1)NC(=O)[C@@H](C)NC(=O)[C@@H]1Cc2cc(O)ccc2CN1)C(C)C)C(=O)NCC(N)=O